Reaction Details
TargetOxytocin receptor
LigandBDBM50410633
Substrate/Competitorn/a
Meas. Tech.ChEMBL_326537 (CHEMBL863355)
Ki 109±n/a nM
Citation Quattropani, ADorbais, JCovini, DPittet, PAColovray, VThomas, RJCoxhead, RHalazy, SScheer, AMissotten, MAyala, GBradshaw, CDe Raemy-Schenk, AMNichols, ACirillo, RTos, EGGiachetti, CGolzio, LMarinelli, PChurch, DJBarberis, CChollet, ASchwarz, MK Discovery and development of a new class of potent, selective, orally active oxytocin receptor antagonists. J Med Chem48:7882-905 (2005) 
 
Oxytocin receptor
Name:Oxytocin receptor
Type:Enzyme Catalytic Domain
Mol. Mass.:42793.26
Organism:Homo sapiens (Human)
Description:Oxytocin OXTR HEK293::B2R9L7
Residue:389
BDBM50410633
NameBDBM50410633
Synonyms:CHEMBL2113195
TypeSmall organic molecule
Emp. Form.C29H30ClN5O7S
Mol. Mass.628.096
SMILESCOC(=O)c1cccc2\C(=N\NC(=O)CN(c3ccc(Cl)cc3)S(=O)(=O)c3ccc(OCCCN(C)C)cc3)C(=O)Nc12