Reaction Details
TargetOxytocin receptor
LigandBDBM50410626
Substrate/Competitorn/a
Meas. Tech.ChEMBL_326541 (CHEMBL863361)
Ki 140±n/a nM
Citation Quattropani, ADorbais, JCovini, DPittet, PAColovray, VThomas, RJCoxhead, RHalazy, SScheer, AMissotten, MAyala, GBradshaw, CDe Raemy-Schenk, AMNichols, ACirillo, RTos, EGGiachetti, CGolzio, LMarinelli, PChurch, DJBarberis, CChollet, ASchwarz, MK Discovery and development of a new class of potent, selective, orally active oxytocin receptor antagonists. J Med Chem48:7882-905 (2005) 
 
Oxytocin receptor
Name:Oxytocin receptor
Type:Enzyme Catalytic Domain
Mol. Mass.:42889.28
Organism:RAT
Description:Oxytocin OXTR RAT::P70536
Residue:388
BDBM50410626
NameBDBM50410626
Synonyms:CHEMBL2113200
TypeSmall organic molecule
Emp. Form.C26H27ClN6O5S
Mol. Mass.571.048
SMILESCN(C)CCCOc1ccc(cc1)S(=O)(=O)N(CC(=O)N\N=C1/C(=O)Nc2ccncc12)c1ccc(Cl)cc1