Reaction Details
TargetOxytocin receptor
LigandBDBM50410638
Substrate/Competitorn/a
Meas. Tech.ChEMBL_326537 (CHEMBL863355)
Ki 8.7±n/a nM
Citation Quattropani, ADorbais, JCovini, DPittet, PAColovray, VThomas, RJCoxhead, RHalazy, SScheer, AMissotten, MAyala, GBradshaw, CDe Raemy-Schenk, AMNichols, ACirillo, RTos, EGGiachetti, CGolzio, LMarinelli, PChurch, DJBarberis, CChollet, ASchwarz, MK Discovery and development of a new class of potent, selective, orally active oxytocin receptor antagonists. J Med Chem48:7882-905 (2005) 
 
Oxytocin receptor
Name:Oxytocin receptor
Type:Enzyme Catalytic Domain
Mol. Mass.:42793.26
Organism:Homo sapiens (Human)
Description:Oxytocin OXTR HEK293::B2R9L7
Residue:389
BDBM50410638
NameBDBM50410638
Synonyms:CHEMBL2113207
TypeSmall organic molecule
Emp. Form.C22H17ClN4O4S
Mol. Mass.468.913
SMILESClc1ccc(cc1)N(CC(=O)NN=C1C(=O)Nc2ccccc12)S(=O)(=O)c1ccccc1