Reaction Details
TargetCytochrome P450 2C9
LigandBDBM50410619
Substrate/Competitorn/a
Meas. Tech.ChEMBL_326550 (CHEMBL864490)
IC50 330±n/a nM
Citation Quattropani, ADorbais, JCovini, DPittet, PAColovray, VThomas, RJCoxhead, RHalazy, SScheer, AMissotten, MAyala, GBradshaw, CDe Raemy-Schenk, AMNichols, ACirillo, RTos, EGGiachetti, CGolzio, LMarinelli, PChurch, DJBarberis, CChollet, ASchwarz, MK Discovery and development of a new class of potent, selective, orally active oxytocin receptor antagonists. J Med Chem48:7882-905 (2005) 
 
Cytochrome P450 2C9
Name:Cytochrome P450 2C9
Type:Enzyme
Mol. Mass.:55636.33
Organism:Homo sapiens (Human)
Description:P11712
Residue:490
BDBM50410619
NameBDBM50410619
Synonyms:CHEMBL2113208
TypeSmall organic molecule
Emp. Form.C27H27ClN4O7S
Mol. Mass.587.044
SMILESCOCCOCCOc1ccc(cc1)S(=O)(=O)N(CC(=O)N\N=C1/C(=O)Nc2ccccc12)c1ccc(Cl)cc1