Reaction Details
TargetcAMP-specific 3',5'-cyclic phosphodiesterase 4B
LigandBDBM50174018
Substrate/Competitorn/a
Meas. Tech.ChEMBL_326770 (CHEMBL860120)
IC50 0.3±n/a nM
Citation Macdonald, DMastracchio, APerrier, HDubé, DGallant, MLacombe, PDeschênes, DRoy, BScheigetz, JBateman, KLi, CTrimble, LADay, SChauret, NNicoll-Griffith, DASilva, JMHuang, ZLaliberté, FLiu, SEthier, DPon, DMuise, EBoulet, LChan, CCStyhler, ACharleson, SMancini, JMasson, PClaveau, DNicholson, DTurner, MYoung, RNGirard, Y Discovery of a substituted 8-arylquinoline series of PDE4 inhibitors: structure-activity relationship, optimization, and identification of a highly potent, well tolerated, PDE4 inhibitor. Bioorg Med Chem Lett15:5241-6 (2005) 
 
cAMP-specific 3',5'-cyclic phosphodiesterase 4B
Name:cAMP-specific 3',5'-cyclic phosphodiesterase 4B
Type:Protein
Mol. Mass.:83318.87
Organism:Homo sapiens (Human)
Description:Q07343
Residue:736
BDBM50174018
NameBDBM50174018
Synonyms:(E)-N-isopropyl-3-(3-(6-isopropylquinolin-8-yl)phenyl)-2-(4-(methylsulfonyl)phenyl)acrylamide | CHEMBL371089
TypeSmall organic molecule
Emp. Form.C31H32N2O3S
Mol. Mass.512.662
SMILESCC(C)NC(=O)C(=C\c1cccc(c1)-c1cc(cc2cccnc12)C(C)C)\c1ccc(cc1)S(C)(=O)=O