Reaction Details
TargetcAMP-specific 3',5'-cyclic phosphodiesterase 4D
LigandBDBM50174029
Substrate/Competitorn/a
Meas. Tech.ChEMBL_326772 (CHEMBL860122)
IC50 0.7±n/a nM
Citation Macdonald, DMastracchio, APerrier, HDubé, DGallant, MLacombe, PDeschênes, DRoy, BScheigetz, JBateman, KLi, CTrimble, LADay, SChauret, NNicoll-Griffith, DASilva, JMHuang, ZLaliberté, FLiu, SEthier, DPon, DMuise, EBoulet, LChan, CCStyhler, ACharleson, SMancini, JMasson, PClaveau, DNicholson, DTurner, MYoung, RNGirard, Y Discovery of a substituted 8-arylquinoline series of PDE4 inhibitors: structure-activity relationship, optimization, and identification of a highly potent, well tolerated, PDE4 inhibitor. Bioorg Med Chem Lett15:5241-6 (2005) 
 
cAMP-specific 3',5'-cyclic phosphodiesterase 4D
Name:cAMP-specific 3',5'-cyclic phosphodiesterase 4D
Type:Protein
Mol. Mass.:91092.69
Organism:Homo sapiens (Human)
Description:Q08499
Residue:809
BDBM50174029
NameBDBM50174029
Synonyms:(E)-3-(3-(6-(2-cyanopropan-2-yl)quinolin-8-yl)phenyl)-N-isopropyl-2-(4-(methylsulfonyl)phenyl)acrylamide | CHEMBL371037
TypeSmall organic molecule
Emp. Form.C32H31N3O3S
Mol. Mass.537.672
SMILESCC(C)NC(=O)C(=C\c1cccc(c1)-c1cc(cc2cccnc12)C(C)(C)C#N)\c1ccc(cc1)S(C)(=O)=O