Reaction Details
TargetcAMP-specific 3',5'-cyclic phosphodiesterase 4A
LigandBDBM50174028
Substrate/Competitorn/a
Meas. Tech.ChEMBL_326769 (CHEMBL860119)
IC50 0.2±n/a nM
Citation Macdonald, DMastracchio, APerrier, HDubé, DGallant, MLacombe, PDeschênes, DRoy, BScheigetz, JBateman, KLi, CTrimble, LADay, SChauret, NNicoll-Griffith, DASilva, JMHuang, ZLaliberté, FLiu, SEthier, DPon, DMuise, EBoulet, LChan, CCStyhler, ACharleson, SMancini, JMasson, PClaveau, DNicholson, DTurner, MYoung, RNGirard, Y Discovery of a substituted 8-arylquinoline series of PDE4 inhibitors: structure-activity relationship, optimization, and identification of a highly potent, well tolerated, PDE4 inhibitor. Bioorg Med Chem Lett15:5241-6 (2005) 
 
cAMP-specific 3',5'-cyclic phosphodiesterase 4A
Name:cAMP-specific 3',5'-cyclic phosphodiesterase 4A
Type:Enzyme
Mol. Mass.:98113.27
Organism:Homo sapiens (Human)
Description:P27815
Residue:886
BDBM50174028
NameBDBM50174028
Synonyms:(E)-6-isopropyl-8-(3-(2-(5-methylpyridin-2-yl)-2-(4-(methylsulfonyl)phenyl)vinyl)phenyl)quinoline | CHEMBL197392
TypeSmall organic molecule
Emp. Form.C33H30N2O2S
Mol. Mass.518.669
SMILESCC(C)c1cc(-c2cccc(\C=C(/c3ccc(cc3)S(C)(=O)=O)c3ccc(C)cn3)c2)c2ncccc2c1