Reaction Details
TargetcAMP-specific 3',5'-cyclic phosphodiesterase 4A
LigandBDBM50174031
Substrate/Competitorn/a
Meas. Tech.ChEMBL_326769 (CHEMBL860119)
IC50 0.4±n/a nM
Citation Macdonald, DMastracchio, APerrier, HDubé, DGallant, MLacombe, PDeschênes, DRoy, BScheigetz, JBateman, KLi, CTrimble, LADay, SChauret, NNicoll-Griffith, DASilva, JMHuang, ZLaliberté, FLiu, SEthier, DPon, DMuise, EBoulet, LChan, CCStyhler, ACharleson, SMancini, JMasson, PClaveau, DNicholson, DTurner, MYoung, RNGirard, Y Discovery of a substituted 8-arylquinoline series of PDE4 inhibitors: structure-activity relationship, optimization, and identification of a highly potent, well tolerated, PDE4 inhibitor. Bioorg Med Chem Lett15:5241-6 (2005) 
 
cAMP-specific 3',5'-cyclic phosphodiesterase 4A
Name:cAMP-specific 3',5'-cyclic phosphodiesterase 4A
Type:Enzyme
Mol. Mass.:98113.27
Organism:Homo sapiens (Human)
Description:P27815
Residue:886
BDBM50174031
NameBDBM50174031
Synonyms:(Z)-2-(4-(2-(3-(6-isopropylquinolin-8-yl)phenyl)-1-(4-(methylsulfonyl)phenyl)vinyl)phenyl)propan-2-ol | CHEMBL198674
TypeSmall organic molecule
Emp. Form.C36H35NO3S
Mol. Mass.561.733
SMILESCC(C)c1cc(-c2cccc(\C=C(\c3ccc(cc3)C(C)(C)O)c3ccc(cc3)S(C)(=O)=O)c2)c2ncccc2c1