Reaction Details
TargetD(1A) dopamine receptor
LigandBDBM50180913
Substrate/Competitorn/a
Meas. Tech.ChEMBL_327098 (CHEMBL859834)
Ki 0.39±n/a nM
Citation Hoefgen, BDecker, MMohr, PSchramm, AMRostom, SAEl-Subbagh, HSchweikert, PMRudolf, DRKassack, MULehmann, J Dopamine/serotonin receptor ligands. 10: SAR Studies on azecine-type dopamine receptor ligands by functional screening at human cloned D1, D2L, and D5 receptors with a microplate reader based calcium assay lead to a novel potent D1/D5 selective antagonist. J Med Chem49:760-9 (2006) 
 
D(1A) dopamine receptor
Name:D(1A) dopamine receptor
Type:Enzyme
Mol. Mass.:49303.43
Organism:Homo sapiens (Human)
Description:P21728
Residue:446
BDBM50180913
NameBDBM50180913
Synonyms:11-methyl-11-aza-tricyclo[12.4.0.0.3,8]octadeca-1(18),3(8),4,6,14,16-hexaen-6-ol 3-hydroxy-7-methyl-5,6,7,8,9,14-hexahydrodibenzo[d,g]azecine CHEMBL1204122 LE404
TypeSmall organic molecule
Emp. Form.C18H21NO
Mol. Mass.267.3654
SMILESCN1CCc2ccccc2Cc2ccc(O)cc2CC1