Reaction Details
TargetMuscarinic acetylcholine receptor M2
LigandBDBM50176708
Substrate/Competitorn/a
Meas. Tech.ChEMBL_327856 (CHEMBL863986)
Ki 0.79±n/a nM
Citation Starck, JPTalaga, PQuéré, LCollart, PChristophe, BLo Brutto, PJadot, SChimmanamada, DZanda, MWagner, AMioskowski, CMassingham, RGuyaux, M Potent anti-muscarinic activity in a novel series of quinuclidine derivatives. Bioorg Med Chem Lett16:373-7 (2005) 
 
Muscarinic acetylcholine receptor M2
Name:Muscarinic acetylcholine receptor M2
Type:GPCR
Mol. Mass.:51730.61
Organism:Homo sapiens (Human)
Description:P08172
Residue:466
BDBM50176708
NameBDBM50176708
Synonyms:(R)-3-((R)-3-methoxyquinuclidin-3-yl)-1-phenyl-1-(pyridin-3-yl)prop-2-yn-1-ol | CHEMBL200171
TypeSmall organic molecule
Emp. Form.C22H24N2O2
Mol. Mass.348.4382
SMILESCO[C@@]1(CN2CCC1CC2)C#C[C@@](O)(c1ccccc1)c1cccnc1