Reaction Details
TargetMuscarinic acetylcholine receptor M2
LigandBDBM50176710
Substrate/Competitorn/a
Meas. Tech.ChEMBL_327856 (CHEMBL863986)
Ki 20±n/a nM
Citation Starck, JPTalaga, PQuéré, LCollart, PChristophe, BLo Brutto, PJadot, SChimmanamada, DZanda, MWagner, AMioskowski, CMassingham, RGuyaux, M Potent anti-muscarinic activity in a novel series of quinuclidine derivatives. Bioorg Med Chem Lett16:373-7 (2005) 
 
Muscarinic acetylcholine receptor M2
Name:Muscarinic acetylcholine receptor M2
Type:GPCR
Mol. Mass.:51730.61
Organism:Homo sapiens (Human)
Description:P08172
Residue:466
BDBM50176710
NameBDBM50176710
Synonyms:(S)-1-cyclohexyl-3-((R)-3-methoxyquinuclidin-3-yl)-1-phenylprop-2-yn-1-ol | CHEMBL371734
TypeSmall organic molecule
Emp. Form.C23H31NO2
Mol. Mass.353.4977
SMILESCO[C@@]1(CN2CCC1CC2)C#C[C@](O)(C1CCCCC1)c1ccccc1