Reaction Details
TargetMuscarinic acetylcholine receptor M3
LigandBDBM50176715
Substrate/Competitorn/a
Meas. Tech.ChEMBL_327855 (CHEMBL863985)
Ki 10±n/a nM
Citation Starck, JPTalaga, PQuéré, LCollart, PChristophe, BLo Brutto, PJadot, SChimmanamada, DZanda, MWagner, AMioskowski, CMassingham, RGuyaux, M Potent anti-muscarinic activity in a novel series of quinuclidine derivatives. Bioorg Med Chem Lett16:373-7 (2005) 
 
Muscarinic acetylcholine receptor M3
Name:Muscarinic acetylcholine receptor M3
Type:Enzyme
Mol. Mass.:66151.03
Organism:Homo sapiens (Human)
Description:P20309
Residue:590
BDBM50176715
NameBDBM50176715
Synonyms:3-(3-methoxyquinuclidin-3-yl)-1-phenyl-1-(pyridin-2-yl)prop-2-yn-1-ol | CHEMBL200210
TypeSmall organic molecule
Emp. Form.C22H24N2O2
Mol. Mass.348.4382
SMILESCOC1(CN2CCC1CC2)C#CC(O)(c1ccccc1)c1ccccn1