Reaction Details
TargetMuscarinic acetylcholine receptor M2
LigandBDBM50176722
Substrate/Competitorn/a
Meas. Tech.ChEMBL_327856 (CHEMBL863986)
Ki 20±n/a nM
Citation Starck, JPTalaga, PQuéré, LCollart, PChristophe, BLo Brutto, PJadot, SChimmanamada, DZanda, MWagner, AMioskowski, CMassingham, RGuyaux, M Potent anti-muscarinic activity in a novel series of quinuclidine derivatives. Bioorg Med Chem Lett16:373-7 (2005) 
 
Muscarinic acetylcholine receptor M2
Name:Muscarinic acetylcholine receptor M2
Type:GPCR
Mol. Mass.:51730.61
Organism:Homo sapiens (Human)
Description:P08172
Residue:466
BDBM50176722
NameBDBM50176722
Synonyms:(R)-1,1-bis(4-fluorophenyl)-3-(3-methoxyquinuclidin-3-yl)prop-2-yn-1-ol | CHEMBL381878
TypeSmall organic molecule
Emp. Form.C23H23F2NO2
Mol. Mass.383.431
SMILESCO[C@@]1(CN2CCC1CC2)C#CC(O)(c1ccc(F)cc1)c1ccc(F)cc1