Reaction Details
TargetMuscarinic acetylcholine receptor M2
LigandBDBM50176723
Substrate/Competitorn/a
Meas. Tech.ChEMBL_327856 (CHEMBL863986)
Ki 0.2±n/a nM
Citation Starck, JPTalaga, PQuéré, LCollart, PChristophe, BLo Brutto, PJadot, SChimmanamada, DZanda, MWagner, AMioskowski, CMassingham, RGuyaux, M Potent anti-muscarinic activity in a novel series of quinuclidine derivatives. Bioorg Med Chem Lett16:373-7 (2005) 
 
Muscarinic acetylcholine receptor M2
Name:Muscarinic acetylcholine receptor M2
Type:GPCR
Mol. Mass.:51730.61
Organism:Homo sapiens (Human)
Description:P08172
Residue:466
BDBM50176723
NameBDBM50176723
Synonyms:(R)-3-(3-methoxyquinuclidin-3-yl)-1,1-di(thiophen-2-yl)prop-2-yn-1-ol | CHEMBL370232
TypeSmall organic molecule
Emp. Form.C19H21NO2S2
Mol. Mass.359.506
SMILESCO[C@@]1(CN2CCC1CC2)C#CC(O)(c1cccs1)c1cccs1