Reaction Details
TargetMuscarinic acetylcholine receptor M3
LigandBDBM50176707
Substrate/Competitorn/a
Meas. Tech.ChEMBL_327855 (CHEMBL863985)
Ki 20±n/a nM
Citation Starck, JPTalaga, PQuéré, LCollart, PChristophe, BLo Brutto, PJadot, SChimmanamada, DZanda, MWagner, AMioskowski, CMassingham, RGuyaux, M Potent anti-muscarinic activity in a novel series of quinuclidine derivatives. Bioorg Med Chem Lett16:373-7 (2005) 
 
Muscarinic acetylcholine receptor M3
Name:Muscarinic acetylcholine receptor M3
Type:Enzyme
Mol. Mass.:66151.03
Organism:Homo sapiens (Human)
Description:P20309
Residue:590
BDBM50176707
NameBDBM50176707
Synonyms:1-cyclobutyl-3-(3-methoxyquinuclidin-3-yl)-1-(pyridin-2-yl)prop-2-yn-1-ol | CHEMBL381020
TypeSmall organic molecule
Emp. Form.C20H26N2O2
Mol. Mass.326.4326
SMILESCOC1(CN2CCC1CC2)C#CC(O)(C1CCC1)c1ccccn1