Reaction Details
TargetMuscarinic acetylcholine receptor M2
LigandBDBM50176732
Substrate/Competitorn/a
Meas. Tech.ChEMBL_327856 (CHEMBL863986)
Ki 0.79±n/a nM
Citation Starck, JPTalaga, PQuéré, LCollart, PChristophe, BLo Brutto, PJadot, SChimmanamada, DZanda, MWagner, AMioskowski, CMassingham, RGuyaux, M Potent anti-muscarinic activity in a novel series of quinuclidine derivatives. Bioorg Med Chem Lett16:373-7 (2005) 
 
Muscarinic acetylcholine receptor M2
Name:Muscarinic acetylcholine receptor M2
Type:GPCR
Mol. Mass.:51730.61
Organism:Homo sapiens (Human)
Description:P08172
Residue:466
BDBM50176732
NameBDBM50176732
Synonyms:(R)-3-(3-methoxyquinuclidin-3-yl)-1,1-diphenylprop-2-yn-1-ol CHEMBL381623
TypeSmall organic molecule
Emp. Form.C23H25NO2
Mol. Mass.347.4501
SMILESCO[C@@]1(CN2CCC1CC2)C#CC(O)(c1ccccc1)c1ccccc1