Reaction Details
TargetMuscarinic acetylcholine receptor M3
LigandBDBM50176717
Substrate/Competitorn/a
Meas. Tech.ChEMBL_327855 (CHEMBL863985)
Ki 0.63±n/a nM
Citation Starck, JPTalaga, PQuéré, LCollart, PChristophe, BLo Brutto, PJadot, SChimmanamada, DZanda, MWagner, AMioskowski, CMassingham, RGuyaux, M Potent anti-muscarinic activity in a novel series of quinuclidine derivatives. Bioorg Med Chem Lett16:373-7 (2005) 
 
Muscarinic acetylcholine receptor M3
Name:Muscarinic acetylcholine receptor M3
Type:Enzyme
Mol. Mass.:66151.03
Organism:Homo sapiens (Human)
Description:P20309
Residue:590
BDBM50176717
NameBDBM50176717
Synonyms:1-(3-methoxyquinuclidin-3-yl)-3-phenylhept-1-yn-3-ol | CHEMBL200416
TypeSmall organic molecule
Emp. Form.C21H29NO2
Mol. Mass.327.4605
SMILESCCCCC(O)(C#CC1(CN2CCC1CC2)OC)c1ccccc1