Reaction Details
TargetSterol O-acyltransferase 1
LigandBDBM50175767
Substrate/Competitorn/a
Meas. Tech.ChEMBL_328123 (CHEMBL863930)
IC50 14±n/a nM
Citation Ban, HMuraoka, MIoriya, KOhashi, N Synthesis and biological activity of novel 4-phenyl-1,8-naphthyridin-2(1H)-on-3-yl ureas: potent acyl-CoA:cholesterol acyltransferase inhibitor with improved aqueous solubility. Bioorg Med Chem Lett16:44-8 (2005) 
 
Sterol O-acyltransferase 1
Name:Sterol O-acyltransferase 1
Type:PROTEIN
Mol. Mass.:64165.56
Organism:Rattus norvegicus
Description:ChEMBL_28796
Residue:545
BDBM50175767
NameBDBM50175767
Synonyms:1-(3-amino-2,6-diisopropylphenyl)-3-(1-butyl-4-(3-methoxyphenyl)-2-oxo-1,2-dihydro-1,8-naphthyridin-3-yl)urea hydrochloride | CHEMBL556797
TypeSmall organic molecule
Emp. Form.C32H39N5O3
Mol. Mass.541.6838
SMILESCCCCn1c2ncccc2c(-c2cccc(OC)c2)c(NC(=O)Nc2c(ccc(N)c2C(C)C)C(C)C)c1=O