Reaction Details
TargetCannabinoid receptor 1
LigandBDBM22988
Substrate/Competitorn/a
Meas. Tech.ChEMBL_328732 (CHEMBL863907)
Ki 72±n/a nM
Citation Urbani, PCavallo, PCascio, MGBuonerba, MDe Martino, GDi Marzo, VSaturnino, C New metabolically stable fatty acid amide ligands of cannabinoid receptors: Synthesis and receptor affinity studies. Bioorg Med Chem Lett16:138-41 (2005) 
 
Cannabinoid receptor 1
Name:Cannabinoid receptor 1
Type:G Protein-Coupled Receptor (GPCR)
Mol. Mass.:52868.96
Organism:Homo sapiens (Human)
Description:P21554
Residue:472
BDBM22988
NameBDBM22988
Synonyms:(5Z,8Z,11Z,14Z)-N-(2-hydroxyethyl)icosa-5,8,11,14-tetraenamide ANANDAMIDE Arachidonoyl ethanolamide (AEA) Arachidonylethanolamide [14C]Anandamide | [3H]Anandamide
Typeradiolabeled substrate
Emp. Form.C22H37NO2
Mol. Mass.347.5347
SMILESCCCCC\C=C/C\C=C/C\C=C/C\C=C/CCCC(=O)NCCO