Reaction Details
TargetCannabinoid receptor 2
LigandBDBM50175112
Substrate/Competitorn/a
Meas. Tech.ChEMBL_328733 (CHEMBL863908)
Ki 4500±n/a nM
Citation Urbani, PCavallo, PCascio, MGBuonerba, MDe Martino, GDi Marzo, VSaturnino, C New metabolically stable fatty acid amide ligands of cannabinoid receptors: Synthesis and receptor affinity studies. Bioorg Med Chem Lett16:138-41 (2005) 
 
Cannabinoid receptor 2
Name:Cannabinoid receptor 2
Type:G Protein-Coupled Receptor (GPCR)
Mol. Mass.:39690.94
Organism:Homo sapiens (Human)
Description:P34972
Residue:360
BDBM50175112
NameBDBM50175112
Synonyms:(5Z,8Z,11Z,14Z)-N-(4-methoxybenzyl)icosa-5,8,11,14-tetraenamide | CHEMBL198079
TypeSmall organic molecule
Emp. Form.C28H41NO2
Mol. Mass.423.6306
SMILESCCCCC\C=C/C\C=C/C\C=C/C\C=C/CCCC(=O)NCc1ccc(OC)cc1