Reaction Details
TargetCannabinoid receptor 2
LigandBDBM50175123
Substrate/Competitorn/a
Meas. Tech.ChEMBL_328733 (CHEMBL863908)
Ki 2500±n/a nM
Citation Urbani, PCavallo, PCascio, MGBuonerba, MDe Martino, GDi Marzo, VSaturnino, C New metabolically stable fatty acid amide ligands of cannabinoid receptors: Synthesis and receptor affinity studies. Bioorg Med Chem Lett16:138-41 (2005) 
 
Cannabinoid receptor 2
Name:Cannabinoid receptor 2
Type:G Protein-Coupled Receptor (GPCR)
Mol. Mass.:39690.94
Organism:Homo sapiens (Human)
Description:P34972
Residue:360
BDBM50175123
NameBDBM50175123
Synonyms:(E)-N-(4-methoxyphenyl)undec-2-enamide | CHEMBL198132
TypeSmall organic molecule
Emp. Form.C18H27NO2
Mol. Mass.289.4125
SMILESCCCCCCCC\C=C\C(=O)Nc1ccc(OC)cc1