Reaction Details
TargetFatty-acid amide hydrolase 1 [30-579]
LigandBDBM50175107
Substrate/Competitorn/a
Meas. Tech.ChEMBL_328735 (CHEMBL863910)
IC50>25000±n/a nM
Citation Urbani, PCavallo, PCascio, MGBuonerba, MDe Martino, GDi Marzo, VSaturnino, C New metabolically stable fatty acid amide ligands of cannabinoid receptors: Synthesis and receptor affinity studies. Bioorg Med Chem Lett16:138-41 (2005) 
 
Fatty-acid amide hydrolase 1 [30-579]
Name:Fatty-acid amide hydrolase 1 [30-579]
Type:Single-pass membrane protein; homodimer
Mol. Mass.:60474.00
Organism:Rattus norvegicus (rat)
Description:P97612 (aa 30-579)
Residue:550
BDBM50175107
NameBDBM50175107
Synonyms:(5Z,8Z,11Z,14Z)-N-(4-morpholinophenyl)icosa-5,8,11,14-tetraenamide | CHEMBL199873
TypeSmall organic molecule
Emp. Form.C30H44N2O2
Mol. Mass.464.6826
SMILESCCCCC\C=C/C\C=C/C\C=C/C\C=C/CCCC(=O)Nc1ccc(cc1)N1CCOCC1