Reaction Details
TargetCannabinoid receptor 1
LigandBDBM50175125
Substrate/Competitorn/a
Meas. Tech.ChEMBL_328732 (CHEMBL863907)
Ki>10000±n/a nM
Citation Urbani, PCavallo, PCascio, MGBuonerba, MDe Martino, GDi Marzo, VSaturnino, C New metabolically stable fatty acid amide ligands of cannabinoid receptors: Synthesis and receptor affinity studies. Bioorg Med Chem Lett16:138-41 (2005) 
 
Cannabinoid receptor 1
Name:Cannabinoid receptor 1
Type:G Protein-Coupled Receptor (GPCR)
Mol. Mass.:52868.96
Organism:Homo sapiens (Human)
Description:P21554
Residue:472
BDBM50175125
NameBDBM50175125
Synonyms:(E)-N-(4-methoxybenzyl)undec-2-enamide | CHEMBL199762
TypeSmall organic molecule
Emp. Form.C19H29NO2
Mol. Mass.303.4391
SMILESCCCCCCCC\C=C\C(=O)NCc1ccc(OC)cc1