Reaction Details
TargetFatty-acid amide hydrolase 1 [30-579]
LigandBDBM50175126
Substrate/Competitorn/a
Meas. Tech.ChEMBL_328735 (CHEMBL863910)
IC50>25000±n/a nM
Citation Urbani, PCavallo, PCascio, MGBuonerba, MDe Martino, GDi Marzo, VSaturnino, C New metabolically stable fatty acid amide ligands of cannabinoid receptors: Synthesis and receptor affinity studies. Bioorg Med Chem Lett16:138-41 (2005) 
 
Fatty-acid amide hydrolase 1 [30-579]
Name:Fatty-acid amide hydrolase 1 [30-579]
Type:Single-pass membrane protein; homodimer
Mol. Mass.:60474.00
Organism:Rattus norvegicus (rat)
Description:P97612 (aa 30-579)
Residue:550
BDBM50175126
NameBDBM50175126
Synonyms:(5Z,8Z,11Z,14Z)-N-(2,4-dimethoxybenzyl)icosa-5,8,11,14-tetraenamide | CHEMBL197601
TypeSmall organic molecule
Emp. Form.C29H43NO3
Mol. Mass.453.6566
SMILESCCCCC\C=C/C\C=C/C\C=C/C\C=C/CCCC(=O)NCc1ccc(OC)cc1OC