Reaction Details
TargetCarbonic anhydrase 9
LigandBDBM10881
Substrate/Competitorn/a
Meas. Tech.ChEMBL_329210 (CHEMBL864590)
Ki 27±n/a nM
Citation Di Fiore, APedone, CD'Ambrosio, KScozzafava, ADe Simone, GSupuran, CT Carbonic anhydrase inhibitors: Valdecoxib binds to a different active site region of the human isoform II as compared to the structurally related cyclooxygenase II"selective" inhibitor celecoxib. Bioorg Med Chem Lett16:437-42 (2005) 
 
Carbonic anhydrase 9
Name:Carbonic anhydrase 9
Type:Enzyme
Mol. Mass.:49669.03
Organism:Homo sapiens (Human)
Description:Catalytic domain of human cloned isozyme was used in the assay
Residue:459
BDBM10881
NameBDBM10881
Synonyms:CHEMBL288100 Methazolamide Methazolamide, MZA Sulfonamide, 2 sulfonamide 2
TypeSmall organic molecule
Emp. Form.C5H8N4O3S2
Mol. Mass.236.272
SMILESCC(=O)N=c1sc(nn1C)S(N)(=O)=O