Reaction Details
TargetCarbonic anhydrase 12
LigandBDBM10884
Substrate/Competitorn/a
Meas. Tech.ChEMBL_329211 (CHEMBL864594)
Ki 3.5±n/a nM
Citation Di Fiore, APedone, CD'Ambrosio, KScozzafava, ADe Simone, GSupuran, CT Carbonic anhydrase inhibitors: Valdecoxib binds to a different active site region of the human isoform II as compared to the structurally related cyclooxygenase II"selective" inhibitor celecoxib. Bioorg Med Chem Lett16:437-42 (2005) 
 
Carbonic anhydrase 12
Name:Carbonic anhydrase 12
Type:Enzyme
Mol. Mass.:39456.00
Organism:Homo sapiens (Human)
Description:Catalytic domain of human cloned isozyme was used in the assay
Residue:354
BDBM10884
NameBDBM10884
Synonyms:(2S,4S)-4-(ethylamino)-2-methyl-1,1-dioxo-2H,3H,4H-1,7-thieno[2,3-b]thiopyran-6-sulfonamide Dorzolamide (DZA)
TypeSmall organic molecule
Emp. Form.C10H16N2O4S3
Mol. Mass.324.44
SMILESCCN[C@H]1C[C@H](C)S(=O)(=O)c2sc(cc12)S(N)(=O)=O