Reaction Details
TargetGABA-A receptor; alpha-5/beta-3/gamma-2
LigandBDBM50176771
Substrate/Competitorn/a
Meas. Tech.ChEMBL_329745 (CHEMBL864005)
Ki 0.20±n/a nM
Citation Goodacre, SCStreet, LJHallett, DJCrawforth, JMKelly, SOwens, APBlackaby, WPLewis, RTStanley, JSmith, AJFerris, PSohal, BCook, SMPike, ABrown, NWafford, KAMarshall, GCastro, JLAtack, JR Imidazo[1,2-a]pyrimidines as functionally selective and orally bioavailable GABA(A)alpha2/alpha3 binding site agonists for the treatment of anxiety disorders. J Med Chem49:35-8 (2006) 
 
GABA-A receptor; alpha-5/beta-3/gamma-2
Name:GABA-A receptor; alpha-5/beta-3/gamma-2
Type:n/a
Mol. Mass.:n/a
Description:ASSAY_ID of ChEMBL is 2148177
Components:This complex has 3 components.
Component 1
Name:Gamma-aminobutyric acid receptor subunit gamma-2
Synonyms:GABA(A) receptor subunit gamma-2 GBRG2_HUMAN
Type:PROTEIN
Mol. Mass.:54172.74
Organism:Homo sapiens (Human)
Description:EBI_217
Residue:467
Component 2
Name:Gamma-aminobutyric acid receptor subunit beta-3
Synonyms:GABA A receptor alpha-4/beta-3/gamma-2 GABA-A receptor GBRB3_HUMAN | agonist GABA site
Type:PROTEIN
Mol. Mass.:54130.51
Organism:Homo sapiens (Human)
Description:ChEMBL_448071
Residue:473
Component 3
Name:Gamma-aminobutyric acid receptor subunit alpha-5
Synonyms:GABA receptor alpha-5 subunit GABRA5 Gamma-aminobutyric acid receptor subunit alpha-5 (GABA(A)) | Gamma-aminobutyric acid receptor subunit alpha-5 (GABAA)
Type:Enzyme
Mol. Mass.:52160.59
Organism:Homo sapiens (Human)
Description:P31644
Residue:462
BDBM50176771
NameBDBM50176771
Synonyms:7-(1,1-dimethyleth-1-yl)-3-(2-fluoro-phenyl)-6-(2-ethyl-2H-1,2,4-trizol-3-ylmethoxy)-[1,2,4]triazolo[4,3-b]pyridazine CHEMBL200177 | TPA-023
TypeSmall organic molecule
Emp. Form.C20H22FN7O
Mol. Mass.395.4334
SMILESCCn1ncnc1COc1nn2c(nnc2cc1C(C)(C)C)-c1ccccc1F