Reaction Details
TargetGamma-aminobutyric acid receptor subunit alpha-3/beta-3/gamma-2
LigandBDBM50180001
Substrate/Competitorn/a
Meas. Tech.ChEMBL_329744 (CHEMBL864004)
Ki 0.38±n/a nM
Citation Goodacre, SCStreet, LJHallett, DJCrawforth, JMKelly, SOwens, APBlackaby, WPLewis, RTStanley, JSmith, AJFerris, PSohal, BCook, SMPike, ABrown, NWafford, KAMarshall, GCastro, JLAtack, JR Imidazo[1,2-a]pyrimidines as functionally selective and orally bioavailable GABA(A)alpha2/alpha3 binding site agonists for the treatment of anxiety disorders. J Med Chem49:35-8 (2006) 
 
Gamma-aminobutyric acid receptor subunit alpha-3/beta-3/gamma-2
Name:Gamma-aminobutyric acid receptor subunit alpha-3/beta-3/gamma-2
Type:n/a
Mol. Mass.:n/a
Description:ASSAY_ID of EBI is 68410
Components:This complex has 3 components.
Component 1
Name:Gamma-aminobutyric acid receptor subunit gamma-2
Synonyms:GABA(A) receptor subunit gamma-2 GBRG2_HUMAN
Type:PROTEIN
Mol. Mass.:54172.74
Organism:Homo sapiens (Human)
Description:EBI_217
Residue:467
Component 2
Name:Gamma-aminobutyric acid receptor subunit beta-3
Synonyms:GABA A receptor alpha-4/beta-3/gamma-2 GABA-A receptor GBRB3_HUMAN | agonist GABA site
Type:PROTEIN
Mol. Mass.:54130.51
Organism:Homo sapiens (Human)
Description:ChEMBL_448071
Residue:473
Component 3
Name:Gamma-aminobutyric acid receptor subunit alpha-3
Synonyms:GABA A Alpha3Beta3Gamma2 GABA C GABA-A receptor GBRA3_HUMAN agonist GABA site
Type:Enzyme Catalytic Domain
Mol. Mass.:55175.47
Organism:Homo sapiens (Human)
Description:GABA A Alpha3Beta1Gamma2 0 HUMAN::P34903
Residue:492
BDBM50180001
NameBDBM50180001
Synonyms:6,2-difluoro-5-(7-trifluoromethylimidazo[1,2-a]pyrimidin-3-yl)biphenyl-2-carbonitrile | CHEMBL382412
TypeSmall organic molecule
Emp. Form.C20H9F5N4
Mol. Mass.400.3043
SMILESFc1ccc(cc1-c1c(F)cccc1C#N)-c1cnc2nc(ccn12)C(F)(F)F