Reaction Details
TargetCannabinoid receptor 2
LigandBDBM50180028
Substrate/Competitorn/a
Meas. Tech.ChEMBL_329835 (CHEMBL854384)
Ki 60.2±n/a nM
Citation Stern, EMuccioli, GGMillet, RGoossens, JFFarce, AChavatte, PPoupaert, JHLambert, DMDepreux, PHénichart, JP Novel 4-oxo-1,4-dihydroquinoline-3-carboxamide derivatives as new CB2 cannabinoid receptors agonists: synthesis, pharmacological properties and molecular modeling. J Med Chem49:70-9 (2006) 
 
Cannabinoid receptor 2
Name:Cannabinoid receptor 2
Type:G Protein-Coupled Receptor (GPCR)
Mol. Mass.:39690.94
Organism:Homo sapiens (Human)
Description:P34972
Residue:360
BDBM50180028
NameBDBM50180028
Synonyms:(+)-N3-(1-(1,2,3,4-tetrahydronaphthyl))-4-oxo-1-pentyl-1,4-dihydroquinoline-3-carboxamide (RS)-N3-(1-(1,2,3,4-tetrahydronaphthyl))-4-oxo-1-pentyl-1,4-dihydroquinoline-3-carboxamide | CHEMBL380610
TypeSmall organic molecule
Emp. Form.C25H28N2O2
Mol. Mass.388.502
SMILESCCCCCn1cc(C(=O)NC2CCCc3ccccc23)c(=O)c2ccccc12