Reaction Details
TargetCannabinoid receptor 2
LigandBDBM50180034
Substrate/Competitorn/a
Meas. Tech.ChEMBL_329835 (CHEMBL854384)
Ki>5000±n/a nM
Citation Stern, EMuccioli, GGMillet, RGoossens, JFFarce, AChavatte, PPoupaert, JHLambert, DMDepreux, PHénichart, JP Novel 4-oxo-1,4-dihydroquinoline-3-carboxamide derivatives as new CB2 cannabinoid receptors agonists: synthesis, pharmacological properties and molecular modeling. J Med Chem49:70-9 (2006) 
 
Cannabinoid receptor 2
Name:Cannabinoid receptor 2
Type:G Protein-Coupled Receptor (GPCR)
Mol. Mass.:39690.94
Organism:Homo sapiens (Human)
Description:P34972
Residue:360
BDBM50180034
NameBDBM50180034
Synonyms:(S)-N3-(1-(2-naphthyl)ethyl)-4-oxo-1-pentyl-1,4-dihydroquinoline-3-carboxamide | CHEMBL383363
TypeSmall organic molecule
Emp. Form.C27H28N2O2
Mol. Mass.412.5234
SMILESCCCCCn1cc(C(=O)N[C@@H](C)c2ccc3ccccc3c2)c(=O)c2ccccc12