Reaction Details
TargetCannabinoid receptor 2
LigandBDBM50180039
Substrate/Competitorn/a
Meas. Tech.ChEMBL_329835 (CHEMBL854384)
Ki 426±n/a nM
Citation Stern, EMuccioli, GGMillet, RGoossens, JFFarce, AChavatte, PPoupaert, JHLambert, DMDepreux, PHénichart, JP Novel 4-oxo-1,4-dihydroquinoline-3-carboxamide derivatives as new CB2 cannabinoid receptors agonists: synthesis, pharmacological properties and molecular modeling. J Med Chem49:70-9 (2006) 
 
Cannabinoid receptor 2
Name:Cannabinoid receptor 2
Type:G Protein-Coupled Receptor (GPCR)
Mol. Mass.:39690.94
Organism:Homo sapiens (Human)
Description:P34972
Residue:360
BDBM50180039
NameBDBM50180039
Synonyms:CHEMBL201056 | N3-(2-(benzo[1,3]dioxol-5-yl)ethyl)-4-oxo-1-pentyl-1,4-dihydroquinoline-3-carboxamide
TypeSmall organic molecule
Emp. Form.C24H26N2O4
Mol. Mass.406.4742
SMILESCCCCCn1cc(C(=O)NCCc2ccc3OCOc3c2)c(=O)c2ccccc12