Reaction Details
Target3-oxoacyl-[acyl-carrier-protein] synthase 2
LigandBDBM50134358
Substrate/Competitorn/a
Meas. Tech.ChEMBL_330092 (CHEMBL863390)
IC50>1000000±n/a nM
Citation Kim, PZhang, YMShenoy, GNguyen, QABoshoff, HIManjunatha, UHGoodwin, MBLonsdale, JPrice, ACMiller, DJDuncan, KWhite, SWRock, COBarry, CEDowd, CS Structure-activity relationships at the 5-position of thiolactomycin: an intact (5R)-isoprene unit is required for activity against the condensing enzymes from Mycobacterium tuberculosis and Escherichia coli. J Med Chem49:159-71 (2006) 
 
3-oxoacyl-[acyl-carrier-protein] synthase 2
Name:3-oxoacyl-[acyl-carrier-protein] synthase 2
Type:PROTEIN
Mol. Mass.:44268.74
Organism:Mycobacterium tuberculosis
Description:ChEMBL_330092
Residue:417
BDBM50134358
NameBDBM50134358
Synonyms:3,5-dimethyl-4-hydroxy-5-(4-methylbenzyl)-5H-thiophen-2-one CHEMBL432983
TypeSmall organic molecule
Emp. Form.C14H16O2S
Mol. Mass.248.341
SMILESCC1C(=O)SC(C)(Cc2ccc(C)cc2)C1=O