Reaction Details
TargetFatty acid synthase
LigandBDBM50138281
Substrate/Competitorn/a
Meas. Tech.ChEMBL_330094 (CHEMBL863392)
IC50 143000±n/a nM
Citation Kim, PZhang, YMShenoy, GNguyen, QABoshoff, HIManjunatha, UHGoodwin, MBLonsdale, JPrice, ACMiller, DJDuncan, KWhite, SWRock, COBarry, CEDowd, CS Structure-activity relationships at the 5-position of thiolactomycin: an intact (5R)-isoprene unit is required for activity against the condensing enzymes from Mycobacterium tuberculosis and Escherichia coli. J Med Chem49:159-71 (2006) 
 
Fatty acid synthase
Name:Fatty acid synthase
Type:Enzyme
Mol. Mass.:273419.37
Organism:Homo sapiens (Human)
Description:P49327
Residue:2511
BDBM50138281
NameBDBM50138281
Synonyms:4-Hydroxy-3,5-dimethyl-5-((E)-2-methyl-buta-1,3-dienyl)-5H-thiophen-2-one CHEMBL322740 | rac-thiolactomycin
TypeSmall organic molecule
Emp. Form.C11H14O2S
Mol. Mass.210.293
SMILESCC1C(=O)SC(C)(\C=C(/C)C=C)C1=O