Reaction Details
Target3-oxoacyl-[acyl-carrier-protein] synthase 1
LigandBDBM50180099
Substrate/Competitorn/a
Meas. Tech.ChEMBL_330089 (CHEMBL863311)
IC50>1000000±n/a nM
Citation Kim, PZhang, YMShenoy, GNguyen, QABoshoff, HIManjunatha, UHGoodwin, MBLonsdale, JPrice, ACMiller, DJDuncan, KWhite, SWRock, COBarry, CEDowd, CS Structure-activity relationships at the 5-position of thiolactomycin: an intact (5R)-isoprene unit is required for activity against the condensing enzymes from Mycobacterium tuberculosis and Escherichia coli. J Med Chem49:159-71 (2006) 
 
3-oxoacyl-[acyl-carrier-protein] synthase 1
Name:3-oxoacyl-[acyl-carrier-protein] synthase 1
Type:PROTEIN
Mol. Mass.:42605.82
Organism:Escherichia coli (strain K12)
Description:ChEMBL_330089
Residue:406
BDBM50180099
NameBDBM50180099
Synonyms:3,5-dimethyl-4-hydroxy-5-(3-trifluoromethylbenzyl)-5H-thiophen-2-one | CHEMBL201541
TypeSmall organic molecule
Emp. Form.C14H13F3O2S
Mol. Mass.302.312
SMILESCC1C(=O)SC(C)(Cc2cccc(c2)C(F)(F)F)C1=O