Reaction Details
Target3-oxoacyl-[acyl-carrier-protein] synthase 3
LigandBDBM50180131
Substrate/Competitorn/a
Meas. Tech.ChEMBL_330093 (CHEMBL863391)
IC50>100000±n/a nM
Citation Kim, PZhang, YMShenoy, GNguyen, QABoshoff, HIManjunatha, UHGoodwin, MBLonsdale, JPrice, ACMiller, DJDuncan, KWhite, SWRock, COBarry, CEDowd, CS Structure-activity relationships at the 5-position of thiolactomycin: an intact (5R)-isoprene unit is required for activity against the condensing enzymes from Mycobacterium tuberculosis and Escherichia coli. J Med Chem49:159-71 (2006) 
 
3-oxoacyl-[acyl-carrier-protein] synthase 3
Name:3-oxoacyl-[acyl-carrier-protein] synthase 3
Type:Enzyme
Mol. Mass.:34865.07
Organism:Mycobacterium tuberculosis
Description:P9WNG3
Residue:335
BDBM50180131
NameBDBM50180131
Synonyms:5-(3-chlorobenzyl)-3,5-dimethyl-4-hydroxy-5H-thiophen-2-one | CHEMBL201711
TypeSmall organic molecule
Emp. Form.C13H13ClO2S
Mol. Mass.268.759
SMILESCC1C(=O)SC(C)(Cc2cccc(Cl)c2)C1=O