Reaction Details
Target3-oxoacyl-[acyl-carrier-protein] synthase 3
LigandBDBM50180119
Substrate/Competitorn/a
Meas. Tech.ChEMBL_330091 (CHEMBL863389)
IC50>1000000±n/a nM
Citation Kim, PZhang, YMShenoy, GNguyen, QABoshoff, HIManjunatha, UHGoodwin, MBLonsdale, JPrice, ACMiller, DJDuncan, KWhite, SWRock, COBarry, CEDowd, CS Structure-activity relationships at the 5-position of thiolactomycin: an intact (5R)-isoprene unit is required for activity against the condensing enzymes from Mycobacterium tuberculosis and Escherichia coli. J Med Chem49:159-71 (2006) 
 
3-oxoacyl-[acyl-carrier-protein] synthase 3
Name:3-oxoacyl-[acyl-carrier-protein] synthase 3
Type:Enzyme
Mol. Mass.:34865.07
Organism:Mycobacterium tuberculosis
Description:P9WNG3
Residue:335
BDBM50180119
NameBDBM50180119
Synonyms:5-cyclohexylmethyl-3,5-dimethyl-4-hydroxy-5H-thiophen-2-one | CHEMBL198344
TypeSmall organic molecule
Emp. Form.C13H20O2S
Mol. Mass.240.362
SMILESCC1C(=O)SC(C)(CC2CCCCC2)C1=O