Reaction Details
TargetDelta-type opioid receptor
LigandBDBM50366764
Substrate/Competitorn/a
Meas. Tech.ChEMBL_330098 (CHEMBL858980)
Ki 0.620000±n/a nM
Citation Peng, XKnapp, BIBidlack, JMNeumeyer, JL Synthesis and preliminary in vitro investigation of bivalent ligands containing homo- and heterodimeric pharmacophores at mu, delta, and kappa opioid receptors. J Med Chem49:256-62 (2006) 
 
Delta-type opioid receptor
Name:Delta-type opioid receptor
Type:G Protein-Coupled Receptor (GPCR)
Mol. Mass.:40382.98
Organism:Homo sapiens (Human)
Description:Competition binding assays were carried out using membrane preparations from transfected HN9.10 cells that constitutively expressed the delta opioid receptor.
Residue:372
BDBM50366764
NameBDBM50366764
Synonyms:CHEMBL1790045 | MCL-117
TypeSmall organic molecule
Emp. Form.C19H23NO
Mol. Mass.281.392
SMILESOc1ccc2C[C@@H]3[C@@H]4CCCC[C@]4(CCN3CC#C)c2c1