Reaction Details
TargetDelta-type opioid receptor
LigandBDBM50180178
Substrate/Competitorn/a
Meas. Tech.ChEMBL_330098 (CHEMBL858980)
Ki 38±n/a nM
Citation Peng, XKnapp, BIBidlack, JMNeumeyer, JL Synthesis and preliminary in vitro investigation of bivalent ligands containing homo- and heterodimeric pharmacophores at mu, delta, and kappa opioid receptors. J Med Chem49:256-62 (2006) 
 
Delta-type opioid receptor
Name:Delta-type opioid receptor
Type:G Protein-Coupled Receptor (GPCR)
Mol. Mass.:40382.98
Organism:Homo sapiens (Human)
Description:Competition binding assays were carried out using membrane preparations from transfected HN9.10 cells that constitutively expressed the delta opioid receptor.
Residue:372
BDBM50180178
NameBDBM50180178
Synonyms:CHEMBL201220 | bis-(3-amino-(-)-N-cyclobutylmethylmorphinan) sebacamide
TypeSmall organic molecule
Emp. Form.C52H74N4O2
Mol. Mass.787.1696
SMILESO=C(CCCCCCCCC(=O)Nc1ccc2C[C@@H]3C4CCCC[C@]4(CCN3CC3CCC3)c2c1)Nc1ccc2C[C@@H]3C4CCCC[C@]4(CCN3CC3CCC3)c2c1