Reaction Details
TargetMu-type opioid receptor
LigandBDBM50105483
Substrate/Competitorn/a
Meas. Tech.ChEMBL_330097 (CHEMBL858889)
Ki 0.062000±n/a nM
Citation Peng, XKnapp, BIBidlack, JMNeumeyer, JL Synthesis and preliminary in vitro investigation of bivalent ligands containing homo- and heterodimeric pharmacophores at mu, delta, and kappa opioid receptors. J Med Chem49:256-62 (2006) 
 
Mu-type opioid receptor
Name:Mu-type opioid receptor
Type:G Protein-Coupled Receptor (GPCR)
Mol. Mass.:44789.51
Organism:Homo sapiens (Human)
Description:P35372
Residue:400
BDBM50105483
NameBDBM50105483
Synonyms:(-)-cyclorphan 17-cyclopropylmethyl-(9R)-17-azatetracyclo[7.5.3.01,10.02,7]heptadeca-2(7),3,5-trien-4-ol CHEMBL291468
TypeSmall organic molecule
Emp. Form.C20H27NO
Mol. Mass.297.4345
SMILESOc1ccc2C[C@@H]3C4CCCC[C@]4(CCN3CC3CC3)c2c1