Reaction Details
TargetMu-type opioid receptor
LigandBDBM50138014
Substrate/Competitorn/a
Meas. Tech.ChEMBL_330097 (CHEMBL858889)
Ki 3.7±n/a nM
Citation Peng, XKnapp, BIBidlack, JMNeumeyer, JL Synthesis and preliminary in vitro investigation of bivalent ligands containing homo- and heterodimeric pharmacophores at mu, delta, and kappa opioid receptors. J Med Chem49:256-62 (2006) 
 
Mu-type opioid receptor
Name:Mu-type opioid receptor
Type:G Protein-Coupled Receptor (GPCR)
Mol. Mass.:44789.51
Organism:Homo sapiens (Human)
Description:P35372
Residue:400
BDBM50138014
NameBDBM50138014
Synonyms:3-Amino-N-cyclobutylmethylmorphinan CHEMBL49143 | MCL-182
TypeSmall organic molecule
Emp. Form.C21H30N2
Mol. Mass.310.4763
SMILESNc1ccc2C[C@@H]3[C@@H]4CCCC[C@]4(CCN3CC3CCC3)c2c1