Reaction Details
TargetKappa-type opioid receptor
LigandBDBM50180186
Substrate/Competitorn/a
Meas. Tech.ChEMBL_330099 (CHEMBL858981)
Ki 7.3±n/a nM
Citation Peng, XKnapp, BIBidlack, JMNeumeyer, JL Synthesis and preliminary in vitro investigation of bivalent ligands containing homo- and heterodimeric pharmacophores at mu, delta, and kappa opioid receptors. J Med Chem49:256-62 (2006) 
 
Kappa-type opioid receptor
Name:Kappa-type opioid receptor
Type:G Protein-Coupled Receptor (GPCR)
Mol. Mass.:42648.76
Organism:Homo sapiens (Human)
Description:P41145
Residue:380
BDBM50180186
NameBDBM50180186
Synonyms:CHEMBL201219 | bis-((-)-N-cyclobutylmethylmorphinan-3-amino) furamide
TypeSmall organic molecule
Emp. Form.C46H60N4O2
Mol. Mass.700.9942
SMILESO=C(Nc1ccc2C[C@@H]3C4CCCC[C@]4(CCN3CC3CCC3)c2c1)\C=C\C(=O)Nc1ccc2C[C@@H]3C4CCCC[C@]4(CCN3CC3CCC3)c2c1