Reaction Details
TargetCannabinoid receptor 1
LigandBDBM50181456
Substrate/Competitorn/a
Meas. Tech.ChEMBL_330572 (CHEMBL871147)
EC50 2103±n/a nM
Citation Muccioli, GGWouters, JCharlier, CScriba, GKPizza, TDi Pace, PDe Martino, PPoppitz, WPoupaert, JHLambert, DM Synthesis and activity of 1,3,5-triphenylimidazolidine-2,4-diones and 1,3,5-triphenyl-2-thioxoimidazolidin-4-ones: characterization of new CB1 cannabinoid receptor inverse agonists/antagonists. J Med Chem49:872-82 (2006) 
 
Cannabinoid receptor 1
Name:Cannabinoid receptor 1
Type:G Protein-Coupled Receptor (GPCR)
Mol. Mass.:52868.96
Organism:Homo sapiens (Human)
Description:P21554
Residue:472
BDBM50181456
NameBDBM50181456
Synonyms:1,3-bis(4-chlorophenyl)-5-phenyl-2-thioxoimidazolidin-4-one | CHEMBL373196
TypeSmall organic molecule
Emp. Form.C21H14Cl2N2OS
Mol. Mass.413.32
SMILESOc1c(-c2ccccc2)n(-c2ccc(Cl)cc2)c(=S)n1-c1ccc(Cl)cc1