Reaction Details
TargetAurora kinase A
LigandBDBM50027228
Substrate/Competitorn/a
Meas. Tech.ChEMBL_330882 (CHEMBL861926)
IC50<1±n/a nM
Citation Jung, FHPasquet, GLambert-van der Brempt, CLohmann, JJWarin, NRenaud, FGermain, HDe Savi, CRoberts, NJohnson, TDousson, CHill, GBMortlock, AAHeron, NWilkinson, RWWedge, SRHeaton, SPOdedra, RKeen, NJGreen, SBrown, EThompson, KBrightwell, S Discovery of novel and potent thiazoloquinazolines as selective Aurora A and B kinase inhibitors. J Med Chem49:955-70 (2006) 
 
Aurora kinase A
Name:Aurora kinase A
Type:Serine/threonine-protein kinase
Mol. Mass.:45830.98
Organism:Homo sapiens (Human)
Description:O14965
Residue:403
BDBM50027228
NameBDBM50027228
Synonyms:CHEMBL201953
TypeSmall organic molecule
Emp. Form.C28H32FN5O3S2
Mol. Mass.569.714
SMILESCOc1cc2c(Nc3ncc(SCc4cccc(F)c4)s3)ncnc2cc1OCCCN1CCC(CO)CC1