Reaction Details
TargetAurora kinase A
LigandBDBM14210
Substrate/Competitorn/a
Meas. Tech.ChEMBL_420092 (CHEMBL873735)
IC50 100.0±n/a nM
Citation Jung, FHPasquet, GLambert-van der Brempt, CLohmann, JJWarin, NRenaud, FGermain, HDe Savi, CRoberts, NJohnson, TDousson, CHill, GBMortlock, AAHeron, NWilkinson, RWWedge, SRHeaton, SPOdedra, RKeen, NJGreen, SBrown, EThompson, KBrightwell, S Discovery of novel and potent thiazoloquinazolines as selective Aurora A and B kinase inhibitors. J Med Chem49:955-70 (2006) 
 
Aurora kinase A
Name:Aurora kinase A
Type:Serine/threonine-protein kinase
Mol. Mass.:45830.98
Organism:Homo sapiens (Human)
Description:O14965
Residue:403
BDBM14210
NameBDBM14210
Synonyms:4-(4-(N-benzoylamino)anilino)-6-methoxy-7-(3-(1-morpholino)propoxy)-quinazoline N-[4-({6-methoxy-7-[3-(morpholin-4-yl)propoxy]quinazolin-4-yl}amino)phenyl]benzamide | ZM447439
TypeSmall organic molecule
Emp. Form.C29H31N5O4
Mol. Mass.513.5875
SMILESCOc1cc2c(Nc3ccc(NC(=O)c4ccccc4)cc3)ncnc2cc1OCCCN1CCOCC1