Reaction Details
TargetAurora kinase A
LigandBDBM50181557
Substrate/Competitorn/a
Meas. Tech.ChEMBL_420088 (CHEMBL873731)
IC50 106±n/a nM
Citation Jung, FHPasquet, GLambert-van der Brempt, CLohmann, JJWarin, NRenaud, FGermain, HDe Savi, CRoberts, NJohnson, TDousson, CHill, GBMortlock, AAHeron, NWilkinson, RWWedge, SRHeaton, SPOdedra, RKeen, NJGreen, SBrown, EThompson, KBrightwell, S Discovery of novel and potent thiazoloquinazolines as selective Aurora A and B kinase inhibitors. J Med Chem49:955-70 (2006) 
 
Aurora kinase A
Name:Aurora kinase A
Type:Serine/threonine-protein kinase
Mol. Mass.:45830.98
Organism:Homo sapiens (Human)
Description:O14965
Residue:403
BDBM50181557
NameBDBM50181557
Synonyms:2-{2-[(7-{3-[(2S)-2-(hydroxymethyl)pyrrolidin-1-yl]propoxy}-6-methoxyquinazolin-4-yl)amino]-1,3-thiazol-5-yl}-N-(3-methoxyphenyl)acetamide | CHEMBL383448
TypeSmall organic molecule
Emp. Form.C29H34N6O5S
Mol. Mass.578.682
SMILESCOc1cccc(NC(=O)Cc2cnc(Nc3ncnc4cc(OCCCN5CCC[C@H]5CO)c(OC)cc34)s2)c1