Reaction Details
TargetEstrogen receptor
LigandBDBM50181363
Substrate/Competitorn/a
Meas. Tech.ChEMBL_331401 (CHEMBL867043)
Ki 5.8±n/a nM
Citation Wallace, OBLauwers, KSDodge, JAMay, SACalvin, JRHinklin, RBryant, HUShetler, PKAdrian, MDGeiser, AGSato, MBurris, TP A selective estrogen receptor modulator for the treatment of hot flushes. J Med Chem49:843-6 (2006) 
 
Estrogen receptor
Name:Estrogen receptor
Type:Protein
Mol. Mass.:66230.44
Organism:Homo sapiens (Human)
Description:P03372
Residue:595
BDBM50181363
NameBDBM50181363
Synonyms:(S)-(-)-7,9-difluoro-5-[4-(2-piperidin-1-ylethoxy)phenyl]-5H-6-oxachrysen-2-ol hydrochloride | CHEMBL559366
TypeSmall organic molecule
Emp. Form.C30H27F2NO3
Mol. Mass.487.5371
SMILESOc1ccc2c3[C@@H](Oc4c(F)cc(F)cc4-c3ccc2c1)c1ccc(OCCN2CCCCC2)cc1