Reaction Details
Target5-hydroxytryptamine receptor 3A/3B
LigandBDBM50181836
Substrate/Competitorn/a
Meas. Tech.ChEMBL_332070 (CHEMBL859602)
Ki 1.2±n/a nM
Citation Becker, DPFlynn, DLMoormann, AENosal, RVillamil, CILoeffler, RGullikson, GWMoummi, CYang, DC Pyrrolizidine esters and amides as 5-HT4 receptor agonists and antagonists. J Med Chem49:1125-39 (2006) 
 
5-hydroxytryptamine receptor 3A/3B
Name:5-hydroxytryptamine receptor 3A/3B
Type:n/a
Mol. Mass.:n/a
Description:ASSAY_ID of EBI is 2974
Components:This complex has 2 components.
Component 1
Name:5-hydroxytryptamine receptor 3B
Synonyms:5HT3B_RAT Serotonin (5-HT) receptor
Type:PROTEIN
Mol. Mass.:50328.78
Organism:Rattus norvegicus
Description:EBI_11885
Residue:437
Component 2
Name:5-hydroxytryptamine receptor 3A
Synonyms:5-HT3 5HT3A_RAT Htr3 Serotonin (5-HT) receptor | Zacopride site-R
Type:Enzyme Catalytic Domain
Mol. Mass.:55428.70
Organism:RAT
Description:5-HT3 HTR3A RAT::P35563
Residue:483
BDBM50181836
NameBDBM50181836
Synonyms:4-Amino-N-(1-aza-tricyclo[3.3.1.0*3,7*]non-4-yl)-5-chloro-2-methoxy-benzamide 4-Amino-N-(1R,3S,4R,7R)-1-aza-tricyclo[3.3.1.0*3,7*]non-4-yl-5-chloro-2-methoxy-benzamide BDBM50449569 CHEMBL319673 | SC-52491
TypeSmall organic molecule
Emp. Form.C16H20ClN3O2
Mol. Mass.321.802
SMILESCOc1cc(N)c(Cl)cc1C(=O)N[C@@H]1C2CC3CN(CC13)C2