Reaction Details
TargetEstrogen receptor beta
LigandBDBM50178329
Substrate/Competitorn/a
Meas. Tech.ChEMBL_332770 (CHEMBL859108)
IC50 14±n/a nM
Citation Blizzard, TAGude, CMorgan, JDChan, WBirzin, ETMojena, MTudela, CChen, FKnecht, KSu, QKraker, BMosley, RTHolmes, MASharma, NFitzgerald, PMRohrer, SPHammond, ML Androstenediol analogs as ER-beta-selective SERMs. Bioorg Med Chem Lett16:834-8 (2006) 
 
Estrogen receptor beta
Name:Estrogen receptor beta
Type:Protein
Mol. Mass.:59238.43
Organism:Homo sapiens (Human)
Description:Q92731
Residue:530
BDBM50178329
NameBDBM50178329
Synonyms:(3S,10S,13S,17S)-17-ethynyl-13-methyl-10-vinyl-2,3,4,7,8,9,10,11,12,13,14,15,16,17-tetradecahydro-1H-cyclopenta[a]phenanthrene-3,17-diol | CHEMBL381566
TypeSmall organic molecule
Emp. Form.C22H30O2
Mol. Mass.326.4724
SMILESC[C@]12CCC3C(CC=C4C[C@@H](O)CC[C@]34C=C)C1CC[C@@]2(O)C#C