Reaction Details
TargetEstrogen receptor beta
LigandBDBM50178316
Substrate/Competitorn/a
Meas. Tech.ChEMBL_332770 (CHEMBL859108)
IC50 16±n/a nM
Citation Blizzard, TAGude, CMorgan, JDChan, WBirzin, ETMojena, MTudela, CChen, FKnecht, KSu, QKraker, BMosley, RTHolmes, MASharma, NFitzgerald, PMRohrer, SPHammond, ML Androstenediol analogs as ER-beta-selective SERMs. Bioorg Med Chem Lett16:834-8 (2006) 
 
Estrogen receptor beta
Name:Estrogen receptor beta
Type:Protein
Mol. Mass.:59238.43
Organism:Homo sapiens (Human)
Description:Q92731
Residue:530
BDBM50178316
NameBDBM50178316
Synonyms:(3S,10R,13S,17S)-10-ethyl-13-methyl-2,3,4,7,8,9,10,11,12,13,14,15,16,17-tetradecahydro-1H-cyclopenta[a]phenanthrene-3,17-diol | CHEMBL382097
TypeSmall organic molecule
Emp. Form.C20H32O2
Mol. Mass.304.4669
SMILESCC[C@]12CC[C@H](O)CC1=CCC1C3CC[C@H](O)[C@@]3(C)CCC21