Reaction Details
TargetAndrogen receptor
LigandBDBM50178337
Substrate/Competitorn/a
Meas. Tech.ChEMBL_332775 (CHEMBL859226)
IC50 7.9±n/a nM
Citation Blizzard, TAGude, CMorgan, JDChan, WBirzin, ETMojena, MTudela, CChen, FKnecht, KSu, QKraker, BMosley, RTHolmes, MASharma, NFitzgerald, PMRohrer, SPHammond, ML Androstenediol analogs as ER-beta-selective SERMs. Bioorg Med Chem Lett16:834-8 (2006) 
 
Androgen receptor
Name:Androgen receptor
Type:Receptor
Mol. Mass.:99185.27
Organism:Homo sapiens (Human)
Description:CHO cells were stably transfected with human AR gene.
Residue:920
BDBM50178337
NameBDBM50178337
Synonyms:(10S,13S,17S)-17-hydroxy-13-methyl-10-vinyl-1,7,8,10,11,12,13,15,16,17-decahydro-2H-cyclopenta[a]phenanthren-3(6H,9H,14H)-one | CHEMBL203748
TypeSmall organic molecule
Emp. Form.C20H28O2
Mol. Mass.300.4351
SMILESC[C@]12CCC3C(CCC4=CC(=O)CC[C@]34C=C)C1CC[C@@H]2O